DATA PROCESSING SERVICES
type: Concept

WEB IMAGE CLASSIFICATION SERVICE
type: Concept
in scheme: sciencekeywords
definition: Performs classification of digital images, using a client-selected supervised or unsupervised image classification method.