CEPHALOPODS
type: Concept

SQUIDS
type: Concept
change note: 2017-03-13 14:24:14.0 [mgenazzi] Definition added insert Definition (id: null text: Phylum Mollusca. Class Cephalopoda. Marine molluscs characterized by a condensed anteroposteriorly and extended dorso-ventrally body plan and a reduce shell with only a pen remaining language code: en);
in scheme: sciencekeywords
definition: Phylum Mollusca. Class Cephalopoda. Marine molluscs characterized by a condensed anteroposteriorly and extended dorso-ventrally body plan and a reduce shell with only a pen remaining