UOGUELPH/GEOGRAPHY/HYDROGEO
type: Concept
change note: 2012-08-17 13:42:12.0 [tbs1979] Insert Concept add broader relation (UOGUELPH/GEOGRAPHY/HYDROGEO [0d9980f5-431d-4210-8c35-04c70e03eebc,40531] - ACADEMIC [7700280b-68ee-4644-bf5e-84e7a6adf897,24357]);
in scheme: providers
definition: The Centre for Hydrogeomatics. We are a research centre based in the Department of Geography at the University of Guelph, Canada. Our focus is the development and application of geospatial technologies for studying hydro-geomorphic phenomenon. Our team includes faculty researchers, graduate students, and research associates. We collaborate with faculty and students in universities around the world and with partners in government agencies and non-government organizations.

ACADEMIC
type: Concept