ACADEMIC
type: Concept

UWF/CEDB
type: Concept
in scheme: providers
definition: The Center for Environmental Diagnostics and Bioremediation (CEDB), established in 1990, works in collaboration with affiliated academic departments and diverse external organizations to enrich the research, teaching, and service functions of the University of West Florida. The CEDB engages in basic and applied research pertinent to the assessment and improvement of environmental health; provides research and training opportunities for graduate and undergraduate students: delivers several core courses and specialized elective courses in support of academic programs in life and environmental sciences; and contributes to public service, including activities to enrich science education at K-12 levels.