ESTUARINE WETLANDS
type: Concept
in scheme: sciencekeywords
definition: Areas of marsh grasses and reeds along coasts and estuaries where the ground is covered by high tides but drained at low tide.

WETLANDS
type: Concept