APRON REEF
type: Concept
change note: 2013-03-22 11:25:19.0 [tbs1979] insert Definition (id: null text: A short reef resembling a fringing reef, but more sloped; extending out and downward from a point or peninsular shore. language code: en);
change note: 2013-02-18 12:23:33.0 [tbs1979] Insert Concept add broader relation (APRON REEF [0e566bce-90bf-4a0a-a000-5bb5fb430788,82567] - CORAL REEFS [dff4d4af-e1e0-4991-884b-a1c088a802b2,82559]);
in scheme: sciencekeywords
definition: A short reef resembling a fringing reef, but more sloped; extending out and downward from a point or peninsular shore.

CORAL REEFS
type: Concept