OPL
type: Concept
in scheme: providers
definition: Oilfield Publications Limited (OPL) is the worlds leading publisher of specialist reference maps, books and vessel registers for the international offshore oil & gas industry. OPL currently publishes more than two hundred titles, including database and CD-ROM versions of our activity & concession maps, offshore oil & gas field development guides and vessel registers. Website: "http://www.oilpubs.com/" [Summary provided by Oilfield Publications Limited]

COMMERCIAL
type: Concept