UGA/NUVMC
type: Concept
in scheme: providers
definition: The National Ultraviolet Monitoring Center(NUVMC) resides in the Physics building on the stunning campus of the University of Georgia in Athens, GA, USA under funding from the US Environmental Protection Agency (EPA). In the beginning, our main purpose was just to maintain the UGA/EPA network of Brewer spectrophotometers. Summary Provided by: http://oz.physast.uga.edu/about/

ACADEMIC
type: Concept