TURBIDITY
type: Concept
change note: 2018-03-07 12:36:13.0 [tstevens] update Definition (Measurement of the degree of scattering of light in water, related to the amount of suspended material in the water.); update Definition (The Open University. 1989. Seawater: its Compostion, Properties and Behaviour. Pergamon Press. p. 66.);
change note: 2018-03-07 08:26:34.0 [tstevens] Move Concepts delete broader relation (null); add broader relation (TURBIDITY [0eaf009f-f92b-48b5-8a71-9c44c80d03d4,85745] - WATER CHARACTERISTICS [f7e97dc3-1181-41b5-8b90-946eb2504110,310633]);
in scheme: sciencekeywords
definition: Measurement of the degree of scattering of light in water, related to the amount of suspended material in the water.

WATER CHARACTERISTICS
type: Concept