SCCWRP
type: Concept
in scheme: projects
definition: SCCWRP is a joint powers agency focusing on marine environmental research. A joint powers agency is one that is formed when several government agencies have a common mission that can be better addressed by pooling resources and knowledge. In our case, the common mission is to gather the necessary scientific information so that our member agencies can effectively, and cost-efficiently, protect the Southern California marine environment. An important part of our mission is to ensure that the data we collect and synthesize effectively reaches decision-makers, scientists and the public. The world-wide web provides us a new opportunity to achieve this goal. Contact Information: Southern California Coastal Water Research Project 7171 Fenwick Lane Westminster, CA 92683 Phone: 714-894-2222 Fax: 714-894 - 9699 For more information, link to "http://www.sccwrp.org/" [Summary provided by SCCWRP]

S - U
type: Concept