A - C
type: Concept

ATMOSPHERIC DRAG EXPERIMENT
type: Concept
in scheme: projects
definition: This experiment was designed to determine nonsystematic changes of upper atmospheric density by conducting studies of the drag on a 3.6-m diameter, low-density sphere caused by short-term variations in solar activity