UN/WHO/UNICEF/JMP
type: Concept
change note: 2013-02-28 10:52:19.0 [tbs1979] Insert Concept add broader relation (UN/WHO/UNICEF/JMP [0f6e7086-1b9b-46da-b3cb-55f89776e403,82711] - MULTINATIONAL ORGANIZATIONS [756a90f8-4203-46f1-87e9-9e0d64bdee50,66455]);
in scheme: providers
definition: The WHO/UNICEF Joint Monitoring Programme (JMP) for Water Supply and Sanitation is the official United Nations mechanism tasked with monitoring progress towards the Millennium Development Goal (MDG) relating to drinking-water and sanitation (MDG 7, Target 7c), which is to: "Halve, by 2015, the proportion of people without sustainable access to safe drinking-water and basic sanitation". Access to drinking-water and to basic sanitation is measured by the MDG indicators: - Proportion of population using an improved drinking-water source; - Proportion of population using an improved sanitation facility. In fulfilling this mandate, the JMP publishes updated estimates every two years on the use of various types of drinking-water sources and sanitation facilities at the national, regional and global levels. The JMP is also collaborating with international organizations and with individual countries to further develop national and global monitoring. In preparation for the post-2015 period, JMP has initiated four working groups to identify potential targets and indicators for water, sanitation, hygiene and equity/non-discrimination.

MULTINATIONAL ORGANIZATIONS
type: Concept