C-131A
type: Concept
change note: 2021-11-17 11:51:40.0 [tstevens] Move Concepts delete broader relation (null); add broader relation (C-131A [0fa676d8-e487-4905-81c7-1a98150e86c8,825978] - Propeller [6175c78e-432c-4254-b442-40d3cf0f6b34,835882]);
in scheme: platforms
definition: The C-131 was a military transport version of the Convair-Liner 240 built by General Dynamics. It was the first pressurized, twin engine transport ordered by the Military Air Transport Service. The T-29 version of this aircraft filled the back of the plane with student stations and was used to train bombardiers, navigators and electronic warfare officers. [Text and Photo provided by: http://www.marchfield.org/c131d.htm ] Group: Platform_Details Entry_ID: C-131A Group: Platform_Identification Platform_Category: Aircraft Short_Name: C-131A Long_Name: Convair C-131 Samaritan End_Group Creation_Date: 2008-07-14 Online_Resource: http://aeroweb.brooklyn.cuny.edu/specs/convair/c-131a.htm Online_Resource: http://www.marchfield.org/c131d.htm Sample_Image: http://www.marchfield.org/c131z262.jpg End_Group

Propeller
type: Concept