ARCS II
type: Concept
change note: 2021-03-24 08:04:16.0 [tstevens] insert AltLabel (id: null category: primary text: The Arctic Challenge for Sustainability II language code: en); insert Definition (id: null text: Aiming to foster the realization of a sustainable society, the ArCS II project will promote advanced research to understand the current status and process of environmental changes in the Arctic and to improve meteorological and climate prediction in order to assess the impact of rapid environmental changes in the Arctic on human society, including Japan, as well as to implement the results of this research into society. language code: en);
change note: 2021-03-24 08:02:22.0 [tstevens] Insert Concept add broader relation (ARCS II [0fc29174-d5bc-464e-ad01-ae02595d4bd6,578374] - A - C [0c89f3f4-7ab1-43ce-89ee-795d35f0e30a,568267]);
in scheme: projects
definition: Aiming to foster the realization of a sustainable society, the ArCS II project will promote advanced research to understand the current status and process of environmental changes in the Arctic and to improve meteorological and climate prediction in order to assess the impact of rapid environmental changes in the Arctic on human society, including Japan, as well as to implement the results of this research into society.

A - C
type: Concept