WEATHER/CLIMATE ADVISORIES
type: Concept

Weather Forecast
type: Concept
change note: 2021-02-18 19:11:41.0 [sritz] Insert Concept add broader relation (Weather Forecast [0fd11f45-185a-4e38-8749-092ee09fab36,560860] - WEATHER/CLIMATE ADVISORIES [c5846f45-863e-43a8-8816-95b3ff359e40,560858]);
in scheme: sciencekeywords
definition: An assessment of the future state of the atmosphere with respect to precipitation, clouds, winds, and temperature. Such assessments are usually made by government or private meteorologists, often using numerical simulations. Such simulations are the result of representing the atmosphere mathematically as a fluid in motion. See also numerical weather prediction.