USDA
type: Concept

USDA/ARS/KDLGSARC/IFNRRU
type: Concept
in scheme: providers
definition: The mission of the Integrated Farming and Natural Resources Research Unit is gather scientific information and devise technologies to facilitate development of more profitable and sustainable integrated crop production systems and area-wide pest management strategies that conserve soil, water, energy, and biological resources. This interdisciplinary management unit (MU) facilitates establishment of integrated crop production systems over large landscapes. [Summary provided by the USDA.]