SEA LEVEL
type: Concept

SEA LEVEL ANOMALY
type: Concept
change note: 2021-10-22 12:51:02.0 [tstevens] insert Definition (id: null text: A sea level anomaly reveals the regional extent of anomalous water levels in the coastal ocean which can indicate unusual water temperatures, salinities, average monthly winds, atmospheric pressures, and/or coastal currents. A sea level anomaly, as defined by NOAA's National Ocean Service, occurs when the 5-month running average of the interannual variation is at least 0.1 meters (4 inches) greater than or less than the long-term trend. The interannual variation is the monthly mean sea level after the trend and the average seasonal cycle are removed. language code: en);
change note: 2021-10-21 09:21:31.0 [tstevens] Move Concepts delete broader relation (null); add broader relation (SEA LEVEL ANOMALY [0fde8353-9773-4948-b206-9c273c2100c8,778234] - SEA LEVEL [9ac7a1c5-4179-47bc-8589-ebaa90d6cbd1,778170]);
change note: 2021-10-21 09:11:54.0 [tstevens] Insert Concept add broader relation (SEA LEVEL ANOMALY [0fde8353-9773-4948-b206-9c273c2100c8,778234] - SEA LEVEL [d17151a9-e03f-49ee-8d3a-d653ac84c071,778233]);
in scheme: sciencekeywords
definition: A sea level anomaly reveals the regional extent of anomalous water levels in the coastal ocean which can indicate unusual water temperatures, salinities, average monthly winds, atmospheric pressures, and/or coastal currents. A sea level anomaly, as defined by NOAA's National Ocean Service, occurs when the 5-month running average of the interannual variation is at least 0.1 meters (4 inches) greater than or less than the long-term trend. The interannual variation is the monthly mean sea level after the trend and the average seasonal cycle are removed.