WEATHER/CLIMATE ADVISORIES
type: Concept

HEAT ADVISORY
type: Concept
in scheme: sciencekeywords
definition: An advisory to alert the public to when daytime heat indices of 105 degrees F or above for two or more consecutive days are expected.