M - O
type: Concept

NASA CubeSat
type: Concept
change note: 2021-08-30 17:16:22.0 [sritz] Insert Concept add broader relation (NASA CubeSat [106de99f-6b91-4f4d-9e59-a245cf81e065,720882] - A - C [0c89f3f4-7ab1-43ce-89ee-795d35f0e30a,714054]);
change note: 2021-08-30 17:20:24.0 [sritz] insert AltLabel (id: null category: primary text: CubeSat Launch Initiative language code: en); insert Definition (id: null text: NASA’s CubeSat Launch Initiative provides opportunities for small satellite payloads built by universities, high schools and non-profit organizations to fly on upcoming launches. Through innovative technology partnerships NASA provides these CubeSat developers a low-cost pathway to conduct scientific investigations and technology demonstrations in space, thus enabling students, teachers and faculty to obtain hands-on flight hardware development experience. language code: en);
change note: 2021-08-30 17:21:25.0 [sritz] update AltLabel (NASA CubeSat Launch Initiative);
change note: 2021-08-30 17:17:11.0 [sritz] Move Concepts delete broader relation (null); add broader relation (NASA CubeSat [106de99f-6b91-4f4d-9e59-a245cf81e065,720882] - M - O [a31c2828-9b6d-44e9-b6ad-7ae81030f322,715102]);
in scheme: projects
definition: NASA’s CubeSat Launch Initiative provides opportunities for small satellite payloads built by universities, high schools and non-profit organizations to fly on upcoming launches. Through innovative technology partnerships NASA provides these CubeSat developers a low-cost pathway to conduct scientific investigations and technology demonstrations in space, thus enabling students, teachers and faculty to obtain hands-on flight hardware development experience.