CONVECTION
type: Concept
in scheme: sciencekeywords
definition: The circulatory vertical motion in a fluid medium (ocean water) owing to the variation of its density and the action of gravity.

OCEAN CIRCULATION
type: Concept