Surface
type: Concept

R/V SERC
type: Concept
change note: 2023-06-15 14:27:34.0 [tstevens] insert AltLabel (id: null category: primary text: Research Vessel Smithsonian Environmental Research Center language code: en); insert Definition (id: null text: SERC has a fleet of research vessels and small open boats for research and education programs on the Chesapeake Bay and its tributaries. Since SERC is located on the Rhode River, our private research dock provides easy access to the river and the mainstem of the Chesapeake Bay. language code: en);
change note: 2023-06-15 14:25:56.0 [tstevens] Insert Concept add broader relation (R/V SERC [10c24d93-c480-42fc-a438-4600e2d14a77,1350572] - Surface [59b97a6c-385e-40a2-8422-ecbdb6023c4c,1340598]);
in scheme: platforms
definition: SERC has a fleet of research vessels and small open boats for research and education programs on the Chesapeake Bay and its tributaries. Since SERC is located on the Rhode River, our private research dock provides easy access to the river and the mainstem of the Chesapeake Bay.