CONSORTIA/INSTITUTIONS
type: Concept

ACADIS
type: Concept
change note: 2013-05-29 16:11:50.0 [aaleman] created new data center insert AltLabel (id: null text: Advanced Cooperative Arctic Data and Information Service language code: en);
change note: 2013-05-29 16:11:05.0 [aaleman] Insert Concept add broader relation (ACADIS [10d6b27f-2bab-4381-818f-2d3360579b36,105165] - CONSORTIA/INSTITUTIONS [aef2fc80-def0-46a4-9259-9dc37e80ed08,66451]);
in scheme: providers
definition: The Advanced Cooperative Arctic Data and Information Service (ACADIS) is a joint effort by the National Snow and Ice Data Center (NSIDC), the University Corporation for Atmospheric Research (UCAR), UNIDATA, and the National Center for Atmospheric Research (NCAR) to provide data archival, preservation and access for all projects funded by NSF's Arctic Science Program (ARC). ACADIS builds on the CADIS project that supported the Arctic Observing Network (AON). This portal will continue to be a gateway for AON data and is being expanded to include all NSF ARC data.