GEOPHONES
type: Concept
in scheme: instruments
definition: Geophones are small, cheap instruments instrument for measuring ground motion. There are many different varieties for different applications. They are designed for earthquakes, machine vibrations, oil exploration, mining, etc... Additional information available at "http://www.tenrats.org/whatis"

Acoustic Sounders
type: Concept