NASA/MSFC/SPB
type: Concept
in scheme: providers
definition: The Solar Physics Branch at NASA's Marshall Space Flight Center was formed in the early 1970's in conjunction with the Apollo Skylab Mission and conducts studies in solar structures, solar features and sun interactions with the Earth. [Summary provided by NASA.]

NASA
type: Concept