UTX-AUSTIN/TMM/TNHC
type: Concept
in scheme: providers
definition: Rooted in the resources and reputation of The University of Texas at Austin, the Texas Natural Science Center works to encourage awareness and appreciation of the interplay of biological, geological and environmental forces as it affects your world. Summary Provided By: http://www.utexas.edu/tmm/press_room/about_tnsc.html

ACADEMIC
type: Concept