FLDAS
type: Concept
change note: 2017-10-10 14:21:22.0 [sritz] insert AltLabel (id: null category: primary text: Famine Early Warning Systems Network (FEWS NET) Land Data Assimilation System language code: en);
change note: 2017-10-10 14:20:30.0 [sritz] Insert Concept add broader relation (FLDAS [11b2edd9-b2f3-474c-84fe-f7aa49f2834a,310233] - D - F [24cf4b0e-4464-4edb-8f0c-415e851a6d79,292305]);
change note: 2017-10-10 14:22:52.0 [sritz] insert Definition (id: null text: The Famine Early Warning Systems Network is a leading provider of early warning and analysis on food insecurity. Created by USAID in 1985 to help decision-makers plan for humanitarian crises, FEWS NET provides evidence-based analysis on some 34 countries. Implementing team members include NASA, NOAA, USDA, and USGS, along with Chemonics International Inc. and Kimetrica language code: en);
definition: The Famine Early Warning Systems Network is a leading provider of early warning and analysis on food insecurity. Created by USAID in 1985 to help decision-makers plan for humanitarian crises, FEWS NET provides evidence-based analysis on some 34 countries. Implementing team members include NASA, NOAA, USDA, and USGS, along with Chemonics International Inc. and Kimetrica
in scheme: projects

D - F
type: Concept