INFRASTRUCTURE
type: Concept

ELECTRICITY
type: Concept
change note: 2012-07-11 10:31:38.0 [tbs1979] update Definition (Associated with the use, production, or transmission of electric power. ); update Definition (http://www.Dictionary.com);
in scheme: sciencekeywords
definition: Associated with the use, production, or transmission of electric power.