G - I
type: Concept

GOES-R PLT
type: Concept
change note: 2021-08-27 12:33:20.0 [tstevens] insert AltLabel (id: null category: primary text: GOES-R Post Launch Test (PLT) Field Campaign language code: en); insert Definition (id: null text: The GOES-R PLT field campaign was a collaborative mission to validate the Advanced Baseline Imager (ABI) and Geostationary Lightning Mapper (GLM) instruments aboard the GOES-R, now GOES-16, satellite. GOES-R is part of NOAA’s geostationary satellite fleet, Geostationary Operational Environmental Satellites - R series, and provides continual observations of primarily North and South America and the Atlantic. The GOES-R PLT campaign lasted roughly 9 weeks from March 21, 2017 to May 17, 2017, with 105.1 mission flight hours. The goal of the campaign was to provide a collection of coincident airborne, satellite, ground based, and near surface measurements of surface weather phenomena to test, validate, and improve the accuracy of GOES-R ABI and GLM measurements. The campaign was comprised of two phases: the first centered on the U.S. west coast, providing tests primarily for the ABI instrument, and the second focused on the central and eastern U.S. with tests primarily for the GLM instrument. Airborne measurements were taken using NASA’s ER-2 aircraft, equipped with spectrometer, radar, lidar, radiometer, and other atmospheric observation instruments to assist with ABI and GLM validation. The target phenomena for validation observations included land and ocean surfaces, active wildfires, and thunderstorms. This campaign provided a blueprint for the operation of future GOES validation projects. language code: en);
change note: 2021-08-27 12:29:17.0 [tstevens] Insert Concept add broader relation (GOES-R PLT [1281dfb5-22f5-4389-b75a-1825823f09f2,720876] - G - I [af0968ce-ffe3-44a0-86de-2ec9b9a8fa5d,715176]);
in scheme: projects
definition: The GOES-R PLT field campaign was a collaborative mission to validate the Advanced Baseline Imager (ABI) and Geostationary Lightning Mapper (GLM) instruments aboard the GOES-R, now GOES-16, satellite. GOES-R is part of NOAA’s geostationary satellite fleet, Geostationary Operational Environmental Satellites - R series, and provides continual observations of primarily North and South America and the Atlantic. The GOES-R PLT campaign lasted roughly 9 weeks from March 21, 2017 to May 17, 2017, with 105.1 mission flight hours. The goal of the campaign was to provide a collection of coincident airborne, satellite, ground based, and near surface measurements of surface weather phenomena to test, validate, and improve the accuracy of GOES-R ABI and GLM measurements. The campaign was comprised of two phases: the first centered on the U.S. west coast, providing tests primarily for the ABI instrument, and the second focused on the central and eastern U.S. with tests primarily for the GLM instrument. Airborne measurements were taken using NASA’s ER-2 aircraft, equipped with spectrometer, radar, lidar, radiometer, and other atmospheric observation instruments to assist with ABI and GLM validation. The target phenomena for validation observations included land and ocean surfaces, active wildfires, and thunderstorms. This campaign provided a blueprint for the operation of future GOES validation projects.