USDA
type: Concept

USDA/ARS/CGPRS
type: Concept
in scheme: providers
definition: The mission of the USDA Central Great Plains Research Station is to enhance the economic and environmental well-being of agriculture by development of integrated cropping systems and technologies for maximum use of soil and water resources. Emphasis is on efficient use of plant nutrients, pesticides, and water and soil conservation / preservation. Website: "http://www.akron.ars.usda.gov/" [Summary provided by the USDA.]