Imaging Spectrometers/Radiometers
type: Concept

ABI
type: Concept
in scheme: instruments
definition: The Advanced Baseline Imager is the primary instrument on the GOES-R series for imaging Earth’s weather, oceans and environment. ABI will view the Earth with 16 different spectral bands (compared to five on current GOES), including two visible channels, four near-infrared channels, and ten infrared channels.
change note: 2017-06-28 16:41:56.0 [sritz] insert Definition (id: null text: The Advanced Baseline Imager is the primary instrument on the GOES-R series for imaging Earth’s weather, oceans and environment. ABI will view the Earth with 16 different spectral bands (compared to five on current GOES), including two visible channels, four near-infrared channels, and ten infrared channels. language code: en);
change note: 2017-06-28 16:40:24.0 [sritz] Insert Concept add broader relation (ABI [12a671f6-d18d-405a-9ff5-432ef2b94135,309781] - Imaging Spectrometers/Radiometers [944b7691-af37-4fb4-9393-c114e7997829,290619]);
change note: 2017-06-28 16:40:46.0 [sritz] insert AltLabel (id: null category: primary text: Advanced Baseline Imager language code: en);
change note: 2017-06-28 16:43:55.0 [sritz] update AltLabel (null); update WeightedRelation (Platform-Instrument); update WeightedRelation (1);
change note: 2017-06-30 14:49:14.0 [sritz] update AltLabel (primary);
change note: 2017-06-28 16:43:29.0 [sritz] insert WeightedRelation (id: null related concept uuid: cbc78fde-7247-4906-b553-92c125fd848d relationship type: null relationship value: null generated by: null);