EARTHQUAKES
type: Concept

EARTHQUAKE PREDICTIONS
type: Concept
change note: 2017-03-10 11:13:10.0 [tstevens] update Definition (NASA GCMD);
change note: 2013-04-02 09:05:59.0 [tbs1979] update Definition (Pertaining to the data used to forecast the likelihood of an earthquake in any given area.);
in scheme: sciencekeywords
definition: Pertaining to the data used to forecast the likelihood of an earthquake in any given area.