GLACIER ELEVATION/ICE SHEET ELEVATION
type: Concept
in scheme: sciencekeywords
definition: Pertaining to the measured height of large thick, glaciers, with an area of at least 50,000 sq. km, covering a continuous stretch of land and growing in all directions.

GLACIERS/ICE SHEETS
type: Concept