LANDSAT-8
type: Concept
change note: 2021-07-23 17:01:14.0 [sritz] insert AltLabel (id: null category: primary text: LANDSAT-8 language code: en);
change note: 2013-06-03 14:16:05.0 [tbs1979] update AltLabel (LANDSAT-8); update PrefLabel (LANDSAT-8);
change note: 2013-06-03 14:16:25.0 [tbs1979] update AltLabel (); update AltLabel (false);
change note: 2019-12-31 16:53:25.0 [sritz] update Definition ([Update, 2013-02-11] The Landsat Data Continuity Mission spacecraft is safely in orbit and sending telemetry back to Earth after a 1:02 p.m. EST liftoff aboard a United Launch Alliance Atlas V 401 rocket. The on-time liftoff followed a smooth countdown at Vandenberg Air Force Base Space Launch Complex 3. [Text Source: NASA LDCM Mission Homepage, http://www.nasa.gov/mission_pages/landsat/main/index.html ] Landsat 8 (formerly called the Landsat Data Continuity Mission, or LDCM) is NASA’s eighth satellite in the Landsat series and continues the Landsat program’s critical role in monitoring, understanding and managing the resources needed for human sustainment such as food, water and forests. As our population surpasses seven billion people, the impact of human society on the planet will increase, and Landsat monitors those impacts as well as environmental changes. With the longest unbroken data stream of Earth’s surface as seen from space, NASA’s Earth-observing Landsat fleet has provided the world with unprecedented information on land cover changes and their residual effects since 1972. The knowledge gained from 40 years of continuous data contributes to research on climate, carbon cycle, ecosystems, water cycle, biogeochemistry and changes to Earth’s surface, as well as our understanding of visible human effects on land surfaces. Building off that research, the Landsat imaging data set has, over time, led to the improvement of human and biodiversity health, energy and water management, urban planning, disaster recovery and agriculture monitoring, all resulting in incalculable benefits to the United States and world economy. Landsat 8 joined the Landsat 7 satellite in orbit and produces stunning pictures of Earth’s surface along with a wealth of scientific data. Landsat 8 measures Earth’s surfaces in the visible, near-infrared, short wave infrared and thermal infrared, with a moderate-resolution of 15 to 100 meters, de…
change note: 2013-06-03 14:18:52.0 [tbs1979] delete AltLabel (null);
definition: [Update, 2013-02-11] The Landsat Data Continuity Mission spacecraft is safely in orbit and sending telemetry back to Earth after a 1:02 p.m. EST liftoff aboard a United Launch Alliance Atlas V 401 rocket. The on-time liftoff followed a smooth countdown at Vandenberg Air Force Base Space Launch Complex 3. [Text Source: NASA LDCM Mission Homepage, http://www.nasa.gov/mission_pages/landsat/main/index.html ] Landsat 8 (formerly called the Landsat Data Continuity Mission, or LDCM) is NASA’s eighth satellite in the Landsat series and continues the Landsat program’s critical role in monitoring, understanding and managing the resources needed for human sustainment such as food, water and forests. As our population surpasses seven billion people, the impact of human society on the planet will increase, and Landsat monitors those impacts as well as environmental changes. With the longest unbroken data stream of Earth’s surface as seen from space, NASA’s Earth-observing Landsat fleet has provided the world with unprecedented information on land cover changes and their residual effects since 1972. The knowledge gained from 40 years of continuous data contributes to research on climate, carbon cycle, ecosystems, water cycle, biogeochemistry and changes to Earth’s surface, as well as our understanding of visible human effects on land surfaces. Building off that research, the Landsat imaging data set has, over time, led to the improvement of human and biodiversity health, energy and water management, urban planning, disaster recovery and agriculture monitoring, all resulting in incalculable benefits to the United States and world economy. Landsat 8 joined the Landsat 7 satellite in orbit and produces stunning pictures of Earth’s surface along with a wealth of scientific data. Landsat 8 measures Earth’s surfaces in the visible, near-infrared, short wave infrared and thermal infrared, with a moderate-resolution of 15 to 100 meters, depending on spectral frequency. Landsat 8 is a col…
in scheme: platforms

Landsat
type: Concept