DRIFTING BUOYS
type: Concept
change note: 2021-08-05 11:33:21.0 [sritz] insert AltLabel (id: null category: primary text: DRIFTING BUOYS language code: en);
in scheme: instruments
definition: A drifting buoy is a floating (or drifting on ice) ocean buoy equipped with meteorological and/or oceanographic sensing instruments linked to transmitting equipment for sending the observed data to collecting centers. [Source: NSIDC]

Current/Wind Meters
type: Concept