NOAA
type: Concept

DOC/NOAA/NOS/MBO/SP
type: Concept
in scheme: providers
definition: Special Projects, a unit within the National Ocean Service's Management and Budget Office, provides technical and discipline-based support services to help the NOS Assistant Administrator and NOS Program and Staff Offices meet new and existing requirements. It does this by offering assistance in six areas of areas of expertise or business lines. http://specialprojects.nos.noaa.gov/