ACADEMIC
type: Concept

WESLEYAN/EES
type: Concept
in scheme: providers
definition: Wesleyan has joined 18 of our peer institutions in the Keck Geology Consortium, a collaboration of geoscience departments that supports undergraduate research experiences around the world. Information provided by http://www.wesleyan.edu/ees/