ARCSS/LAII
type: Concept
in scheme: projects
definition: Land-Atmosphere-Ice Interactions (LAII) research seeks to understand interactions between land, atmosphere, and ice in the Arctic. LAII research, focusing primarily on Alaska, constitutes a major contribution of land-based data to U.S. global change research in the Arctic. For more information, link to "http://arcss.colorado.edu/arcss/projects/laii.html"

A - C
type: Concept