MACROFOSSILS
type: Concept
change note: 2012-07-19 15:11:09.0 [mpmorahan] insert Definition (id: null text: Macrofossils are fossils large enough to be studied without the aid of a microscope. Macrofossils can indicate the range of plant or animal species in the past. language code: en);
change note: 2012-06-26 14:04:08.0 [gee-cee] Insert Concept add broader relation (MACROFOSSILS [14c78811-5296-4095-9c44-26362914e798,39961] - BIOLOGICAL RECORDS [5553fe9d-ab0a-4305-86a6-1f7f697e15e4,39951]);
in scheme: sciencekeywords
definition: Macrofossils are fossils large enough to be studied without the aid of a microscope. Macrofossils can indicate the range of plant or animal species in the past.

BIOLOGICAL RECORDS
type: Concept