VOLCANO MAGNITUDE/INTENSITY
type: Concept
change note: 2013-04-02 09:48:48.0 [tbs1979] insert Definition (id: null text: The magnitude and intensity of a volcano, also expressed as a numerical expression of the amount of energy released by an volcano, determined by measuring volcanic intensity on standardized recording instruments. language code: en);
change note: 2013-03-07 09:13:19.0 [tbs1979] Insert Concept add broader relation (VOLCANO MAGNITUDE/INTENSITY [14e0d39a-ff1c-46d9-b162-481f80beac91,83157] - VOLCANIC ACTIVITY [1faaede0-2cd6-4447-b28b-0a28d9e2d067,61647]);
in scheme: sciencekeywords
definition: The magnitude and intensity of a volcano, also expressed as a numerical expression of the amount of energy released by an volcano, determined by measuring volcanic intensity on standardized recording instruments.

VOLCANIC ACTIVITY
type: Concept