WATER VAPOR
type: Concept
change note: 2017-04-21 13:10:16.0 [sritz] update Definition (Water substance in vapor form; one of the most important of all constituents of the atmosphere.); update Definition (Glossary of Meteorology, American Meteorological Society);
change note: 2017-04-20 14:12:14.0 [sritz] Move Concepts delete broader relation (null); add broader relation (WATER VAPOR [15029eb0-6342-4066-8ac9-c50f7dbfb392,84655] - WATER VAPOR INDICATORS [005d192a-95b9-4fc2-afed-f87da3c3dc33,278815]);
in scheme: sciencekeywords
definition: Water substance in vapor form; one of the most important of all constituents of the atmosphere.

WATER VAPOR INDICATORS
type: Concept