FLORIDA
type: Concept

FL/FWC/FMRI
type: Concept
in scheme: providers
definition: The mission of the Florida Marine Research Institute (FMRI) is to provide timely information and guidance to protect, conserve and manage Florida's marine and coastal resources. FMRI Science Programs: Fisheries-Independent Monitoring - Staff in this program monitor the status and relative abundance of recreational and commercial fishes from six estuaries around the state. Fisheries-Dependent Monitoring - Program staff collect and analyze catch-and-effort data used to monitor trends in commercial and recreational fisheries throughout Florida. These data provide assessments of how management regulations affect harvest and fishers. Fisheries Biology - The Fisheries Biology program staff collect and provide data concerning the life history, biology, age structure, stock abundance, and fishery characteristics of important commercial and recreational fishes in Florida. Fisheries Stock Assessment - Program staff integrate the biological and fisheries data gathered in the three above programs and use these data to analyze Florida's inshore and nearshore fisheries stocks. This information is provided to the FWC for management purposes. Coral Reefs & Hard Grounds - Staff in this program provide information on the health and status of Florida's coral reefs and hard grounds, and assess long-term degradation as well as the effects of events such as hurricanes and vessel groundings. Habitat Assessment & Restoration - Program staff work around the state to collect data that resource managers must have to make effective decisions about the preservation, management, and restoration of seagrass, salt marsh, and mangrove communities. Aquatic Health - In this program, staff monitor and study marine organism diseases, die-offs, and fish kills and the causes that may be associated with these events, for example, infectious agents, parasites, contaminants, red tides, biological toxins, and poor water quality. Harmful Algal Blooms - Staff in this program study red tides and related impacts…