SPOT/US
type: Concept
in scheme: providers
definition: SPOT Image provides Earth observation products for such diverse applications as agriculture, cartography, cadastral mapping, environmental studies, urban planning, telecommunications, surveillance, forestry, land use/land cover mapping, natural hazard assessments, flood risk management, oil and gas exploration, geology and civil engineering. SPOT Image is the world's leading supplier of geographic information from optical and Earth observation satellites, compatible with all image processing and GIS systems. Its range of products include geocoded and orthocorrected images, DEMs, and land classification datasets. Website: "http://www.spotimage.fr/html/_167_.php/" [Summary provided by SPOT Image Corporation]

COMMERCIAL
type: Concept