OCEAN SURFACE SALINITY
type: Concept
change note: 2021-10-21 08:35:44.0 [tstevens] insert Definition (id: null text: Salinity of sea water in the surface layer. language code: en);
change note: 2021-10-21 08:34:54.0 [tstevens] Insert Concept add broader relation (OCEAN SURFACE SALINITY [1544c1fe-58dd-4b19-bf9e-457b4f21ef29,778229] - OCEAN SALINITY [1a4e5774-7d4a-4ce7-9a4c-e2c72c8c377f,778225]);
in scheme: sciencekeywords
definition: Salinity of sea water in the surface layer.

OCEAN SALINITY
type: Concept