OV-105
type: Concept
change note: 2021-11-30 12:28:06.0 [tstevens] Move Concepts delete broader relation (null); add broader relation (OV-105 [15541ce2-b06c-4597-8eb1-745e1c72600b,825998] - SPACE SHUTTLE [3ef93fbf-1e19-42a9-a91f-502d125dbb7c,826168]);
change note: 2021-11-30 12:09:13.0 [tstevens] Move Concepts delete broader relation (null); add broader relation (OV-105 [15541ce2-b06c-4597-8eb1-745e1c72600b,825998] - Space-based Platforms [b39a69b4-c3b9-4a94-b296-bbbbe5e4c847,835875]);
change note: 2021-11-30 12:15:08.0 [tstevens] Move Concepts delete broader relation (null); add broader relation (OV-105 [15541ce2-b06c-4597-8eb1-745e1c72600b,825998] - Space Stations/Crewed Spacecraft [388e72a1-b851-4b78-9e69-747e06ae215f,826132]);
in scheme: platforms
definition: Endeavour, the newest addition to the four-orbiter fleet, is named after the first ship commanded by James Cook, the 18th century British explorer, navigator and astronomer. For the first time, a national competition involving students in elementary and secondary schools produced the name of the new orbiter; it was announced by President George Bush in 1989. The Space Shuttle orbiter Endeavour was delivered to Kennedy Space Center in May 1991, and flew its first mission, highlighted by the dramatic rescue of a stranded communications satellite, a year later in May 1992. Endeavour features new hardware designed to improve and expand orbiter capabilities. Most of this equipment was later incorporated into the other three orbiters during out-of-service major inspection and modification programs. Endeavour's upgrades include: -A 40-foot diameter drag chute that is expected to reduce the orbiter's rollout distance by 1,000 to 2,000 feet. -The plumbing and electrical connections needed for Extended Duration Orbiter (EDO) modifications to allow up to 28-day missions. -Updated avionics systems that include advanced general purpose computers, improved inertial measurement units and tactical air navigation systems, enhanced master events controllers and multiplexer-demultiplexers, a solid-state star tracker and improved nose wheel steering mechanisms. -An improved version of the Auxiliary Power Units (APU's) that provide power to operate the Shuttle's hydraulic systems. [Summary provided by NASA] Group: Platform_Details Entry_ID: OV-105 Group: Platform_Identification Platform_Category: Space Stations/Manned Spacecraft Platform_Series_or_Entity: SPACE SHUTTLE Short_Name: OV-105 Long_Name: Endeavour Space Shuttle End_Group Group: Synonymous_Platform_Names Short_Name: Endeavour End_Group Creation_Date: 2008-01-25 Online_Resource: http://science.ksc.nasa.gov/shuttle/resources/orbiters/endeavour.html Sample_Image: http://www-pao.ksc.nasa.gov/kscpao/images/medium/02pd0590-m.jpg Gro…

Space Shuttle
type: Concept