BRACKISH MARSH
type: Concept
change note: 2016-06-14 11:30:40.0 [gee-cee] insert Definition (id: null text: Pertaining to salt marshes where a significant freshwater influx dilutes the seawater to brackish levels of salinity. language code: en);
change note: 2016-06-14 11:30:11.0 [gee-cee] Insert Concept add broader relation (BRACKISH MARSH [155e730b-4e22-4962-adc5-a4b92543a442,188225] - ESTUARINE HABITAT [5a1ebca4-057d-43b9-af6a-04f57b93f8bb,84263]);
in scheme: sciencekeywords
definition: Pertaining to salt marshes where a significant freshwater influx dilutes the seawater to brackish levels of salinity.

ESTUARY
type: Concept