SCES/RELM
type: Concept
in scheme: providers
definition: The 2007 Working Group on California Earthquake Probabilities (WGCEP 2007), a multi-disciplinary collaboration of scientists and engineers, has released the Uniform California Earthquake Rupture Forecast (UCERF)—the first comprehensive framework for comparing earthquake likelihoods throughout all of California. It provides important new information for improving seismic safety engineering, revising building codes, setting insurance rates, and helping communities prepare for inevitable future earthquakes. Summary Provided by: http://www.scec.org/ucerf/

CONSORTIA/INSTITUTIONS
type: Concept