Recorders/Loggers
type: Concept

TAMMS
type: Concept
change note: 2020-07-20 08:48:55.0 [tstevens] insert AltLabel (id: null category: primary text: Turbulent Air Motion Measurement System language code: en); insert Definition (id: null text: The TAMMS is composed of several subsystems including: (1) distributed pressure ports coupled with absolute and differential pressure transducers and temperature sensors, (2) aircraft inertial and satellite navigation systems, (3) a central data acquisition/processing system, and (4) water vapor instruments and potentially other trace gas or aerosol sensors. language code: en);
change note: 2020-07-20 08:47:37.0 [tstevens] Insert Concept add broader relation (TAMMS [172007bb-2b5d-478a-8875-2aa653b9103d,560534] - Recorders/Loggers [ebfff02c-2e5a-476e-aafb-c00167bf2daa,546147]);
in scheme: instruments
definition: The TAMMS is composed of several subsystems including: (1) distributed pressure ports coupled with absolute and differential pressure transducers and temperature sensors, (2) aircraft inertial and satellite navigation systems, (3) a central data acquisition/processing system, and (4) water vapor instruments and potentially other trace gas or aerosol sensors.