UB-ES/FGEO/DGG
type: Concept
in scheme: providers
definition: The Department of Geophysics and Geodynamics aims to teaching and research in these fields, with particular attention to: • Structure resulting from the deformation of sedimentary basins and its significance in the evaluation of Geological Resources. • Geologic processes that modify the shape of the Earth's surface and its impact to natural hazards. • Geophysical methods of investigation of the subsoil and the interior of the Earth, data modeling and inversion. [Summary provided by the Departamento Geodinimica y Geofisica, Facultat de Geologia, Universidad de Barcelona]

ACADEMIC
type: Concept