RADIOMETERS
type: Concept
in scheme: instruments
definition: RADIOMETERS are meters used to detect and measure radiant energy that can be either electromagnetic or acoustic; measures radiated electromagnetic power.

Radiometers
type: Concept