STORM RELATIVE WINDS
type: Concept
change note: 2017-04-21 11:25:10.0 [tstevens] insert Definition (id: null text: (Winds) measured relative to a moving thunderstorm, usually referring to winds, wind shear, or helicity. language code: en);
change note: 2017-04-20 14:47:33.0 [sritz] Insert Concept add broader relation (STORM RELATIVE WINDS [185b86e2-af35-42b2-b20d-f9ca6fdab493,278871] - SURFACE WINDS [10685919-bc01-43e7-901a-b62ac44627f3,83353]);
in scheme: sciencekeywords
definition: (Winds) measured relative to a moving thunderstorm, usually referring to winds, wind shear, or helicity.

SURFACE WINDS
type: Concept